BDBM165200 US8168651, Compound TABLE 14A.3::US9062043, Table 10, Compound 3
SMILES OCCCOc1nc2cc(ccc2c2ccccc12)C(O)=O
InChI Key InChIKey=FPKDRTWKHDPOQA-UHFFFAOYSA-N
Data  2 IC50
  Tab Delimited (TSV)   2D SDfile   Computed 3D by Vconf -m prep SDfile
Find this compound or compounds like it in BindingDB:
Activity Spreadsheet -- Enzyme Inhibition Constant Data from BindingDB
Found 2 hits for monomerid = 165200
TargetPoly [ADP-ribose] polymerase 1(Homo sapiens (Human))
Cylene Pharmaceuticals
US Patent
LigandPNGBDBM165200(US8168651, Compound TABLE 14A.3 | US9062043, Table...)
Affinity DataIC50:  400nM. Assay description: PARP assays are conducted using a chemiluminescent PARP assay kit (Trevigen). Briefly, reactions are performed in Histone-coated strip wells, by addi...
Ligand InfoPC cidPC sid
In DepthDetails US Patent
TargetPoly [ADP-ribose] polymerase 1(Homo sapiens (Human))
Cylene Pharmaceuticals
US Patent
LigandPNGBDBM165200(US8168651, Compound TABLE 14A.3 | US9062043, Table...)
Affinity DataIC50:  400nM. Assay description: PARP assays are conducted using a chemiluminescent PARP assay kit (Trevigen). Briefly, reactions are performed in Histone-coated strip wells, by addi...
Ligand InfoPC cidPC sid
In DepthDetails US Patent